{"text_format":"1","workbook":"xlsx","n_sheets":7,"sheets":["Zusammenfassung","Gruppe 1","Gruppe 2","Gruppe 3","Gruppe 4","Gruppe 5","Dropdownfelder"],"not_rendered":{"charts":0,"images":0,"macros":1,"external_links":0,"defined_names":5,"comments":0,"pivot_tables":0},"unopened":[],"bounds":{"document_bytes":16777216,"sheet_cells":100000,"rows_first":2000,"rows_last":500,"rows_between":2000,"halvings":0,"cell_chars":16384,"cell_head_chars":4096},"cells_cut":0,"cells_raw":0,"read":"whole","date_system":"1900"}

{"sheet":"Zusammenfassung","index":0,"n_rows":14,"n_cols":7,"rows_kept":14,"cut":false,"hidden":false,"merged":[[2,1,2,7],[4,7,4,8]]}
["Mindestpersonalbedarf lt. KiföG für Kindertagesstätte: "]
[]
[null,"NAME Kindertagesstätte"]
[]
[null,"Personalbedarf",null,null,null,null,"Datum:"]
["Gruppe 1",{"$f":"'Gruppe 1'!I23","v":""},"Zur Gruppe 1 wechseln!"]
["Gruppe 2",{"$f":"'Gruppe 2'!I23","v":""},"Zur Gruppe 2 wechseln!"]
["Gruppe 3",{"$f":"'Gruppe 3'!I23","v":""},"Zur Gruppe 3 wechseln!"]
["Gruppe 4",{"$f":"'Gruppe 4'!I23","v":""},"Zur Gruppe 4 wechseln!"]
["Gruppe 5",{"$f":"'Gruppe 5'!I23","v":""},"Zur Gruppe 5 wechseln!"]
[]
["PERSONALBEDARF",{"$f":"SUM(B6:B10)","v":0}]
["Personal Ist-Stand",null,{"$f":"IF(B13=0,\"<<<Eingabe fehlt!!!\",\"\")","v":"<<<Eingabe fehlt!!!"}]
["lt. Anlage 4",{"$f":"B13-B12","v":0}]

{"sheet":"Gruppe 1","index":1,"n_rows":37,"n_cols":15,"rows_kept":37,"cut":false,"hidden":false,"merged":[[36,0,44,8],[20,1,20,5],[6,8,7,8],[6,2,6,6],[8,0,11,0],[12,0,15,0],[16,0,19,0],[6,0,7,0],[6,1,7,1],[6,7,7,7]]}
["PERSONALBEDARFSBERECHNUNG",null,null,null,null,null,null,null,"Ó Landkreis Fulda"]
[]
["Gruppentyp:",{"$f":"IF(A28=1,\"<<<Auswahl treffen!\",VLOOKUP(A28,A29:C33,2,FALSE))","v":"<<<Auswahl treffen!"},null,{"$f":"IF(A28=1,\"<<<Auswahl treffen!\",VLOOKUP(A28,A29:C33,1,FALSE))","v":"<<<Auswahl treffen!"},null,{"$f":"IF(D3=\"<<<Auswahl treffen!\",0,D3)","v":0},{"$f":"IF(F3=4,IF(G21>12,1,0),IF(G21>25,1,0))","v":1}]
[null,{"$f":"IF(OR(F3=2,F3=5),IF(SUM(C9:D16)>SUM(C13:D16),\"ACHTUNG GRUPPENTYP FALSCH!!!\",\"\"),\"\")","v":""},null,null,null,null,{"$f":"IF(G21=\"\",\"\",G3)","v":""}]
["Mindestpersonalbedarf nach § 25c Abs. 1 und 2 HKJGB in Verbindung mit Ziff. 4.6. der RV Integrationsplatz"]
[]
["Altersgruppe","Betreuungsmittelwert","Vertraglich aufgenommene Kinder",null,null,null,null,"Fachkraftfaktor","Mindestfachkraftstd. pro Woche"]
[null,null,"Kinder ohne Behinderung","Kinder mit Behinderung","Faktor nach 4.5. RV I-Platz","KmB mit Faktor","Zwischensumme"]
["0 - 3 Jahre",22.5,null,null,2,{"$f":"IF(D9>0,D9*E9,\"\")","v":""},{"$f":"IF(SUM(C9:D9)>0,C9+(D9*E9),\"\")","v":""},0.2,{"$f":"IF(G9=\"\",\"\",B9*G9*H9)","v":""}]
[null,30,null,null,2,"","",0.2,""]
[null,42.5,null,null,2,"","",0.2,""]
[null,50,null,null,2,"","",0.2,""]
["3 Jahre bis Schuleintritt",22.5,null,null,{"$f":"IF($F$3=2,IF(K13+L13+O13=0,N13,K13+L13+O13),3)","v":3},{"$f":"IF(D13>0,IF(E13=N13,7,D13*E13),\"\")","v":""},{"$f":"IF(D13=\"\",IF(C13=\"\",\"\",C13),C13+F13)","v":""},7.0000000000000007E-2,"",null,{"$f":"IF(SUM($D$13:$D$16)>2,3,0)","v":0},{"$f":"IF(SUM($D$13:$D$16)=1,6,0)","v":0},{"$f":"IF(SUM($D$13:$D$16)=2,D13,0)","v":0},{"$f":"IF(M13=2,\"3/4\",0)","v":0},{"$f":"IF(M13=1,3,0)","v":0}]
[null,30,null,null,{"$f":"IF($F$3=2,IF(K14+L14+O14=0,N14,K14+L14+O14),3)","v":3},{"$f":"IF(D14>0,IF(E14=N14,7,D14*E14),\"\")","v":""},{"$f":"IF(D14=\"\",IF(C14=\"\",\"\",C14),C14+F14)","v":""},7.0000000000000007E-2,"",null,{"$f":"IF(SUM($D$13:$D$16)>2,3,0)","v":0},{"$f":"IF(SUM($D$13:$D$16)=1,6,0)","v":0},{"$f":"IF(SUM($D$13:$D$16)=2,D14,0)","v":0},{"$f":"IF(M14=2,\"3/4\",0)","v":0},{"$f":"IF(M14=1,IF(SUM(M14:M16)=1,4,3),0)","v":0}]
[null,42.5,null,null,3,"",{"$f":"IF(D15=\"\",IF(C15=\"\",\"\",C15),C15+F15)","v":""},7.0000000000000007E-2,"",null,{"$f":"IF(SUM($D$13:$D$16)>2,3,0)","v":0},0,0,0,{"$f":"IF(M15=1,IF(SUM(M15:M16)=1,4,3),0)","v":0}]
[null,50,null,null,3,"","",7.0000000000000007E-2,"",null,{"$f":"IF(SUM($D$13:$D$16)>2,3,0)","v":0},0,0,0,{"$f":"IF(M16=1,IF(M16=1,4,3),0)","v":0}]
["Schulkinder",22.5,null,null,1,"","",0.06,""]
[null,30,null,null,1,"","",0.06,""]
[null,42.5,null,null,1,null,"",0.06,""]
[null,50,null,null,1,"","",0.06,""]
["Zwischensumme",{"$f":"IF(G4=1,\"ACHTUNG GRUPPENGRÖßE >>>\",\"\")","v":""},null,null,null,null,{"$f":"IF(SUM(C9:D20)>0,SUM(G9:G20),\"\")","v":""},null,{"$f":"SUM(I9:I20)","v":0}]
["Ausfallzeiten",null,null,null,null,null,null,null,{"$f":"I21/100*15","v":0}]
["Gesamt",null,null,null,null,null,null,{"$f":"IF(I23=\"\",\"GRUPPENTYP WÄHLEN!!!\",\"\")","v":"GRUPPENTYP WÄHLEN!!!"},{"$f":"IF(A28=1,\"\", I21+I22)","v":""}]
[]
[]
[]
[null,null,null,null,{"$f":"IF(A28=1,IF(SUM(C9:D20)>0,1,0),0)","v":0},1,1]
[1,"Gruppentyp",null,null,{"$f":"IF(SUM(C9:D20)=0,IF(OR(A28=2,A28=5),2,0),0)","v":0}]
[1,"BITTE WÄHLEN","<<<Auswahl treffen!"]
[2,"ü3-Gruppe",1]
[3,"altergemischte Gruppe",2]
[4,"Krippengruppe",3]
[5,"ü3-Gruppe (ohne Platzreduzierung)",4]
[]
["Die Rahmenvereinbarung fordert in Ziff. 4.6., dass bei einer Gruppe, deren Belegung aufgrund der Aufnahme von Kindern mit Behinderung reduziert werden muss, bezüglich der Personalbedarfsberechnung von einer vollen Gruppe ausgegangen werden muss. Dies bezieht sich auf die \"Sondersituation\", dass in einer Ü3-Gruppe maximal 20 Kinder aufgenommen werden dürfen. Umgekehrt bedeutet dies, dass in allen anderen Fällen auch keine Personalbedarfsberechnung wie bei einer vollen Gruppe erfolgen muss, z.B. bei unterbesetzten Gruppen. Daher müssen Sie nun entscheiden, ob bei Ihnen eine Situation vorliegt, in der die Aufnahme der Kinder mit Behinderung zwingend zu einer Gruppenreduzierung auf 20 führt; dann verwenden Sie bitte die Tabelle \"Ü3\". In allen anderen Fällen verwenden Sie  bitte den Typ \"Ü3 (ohne Platzreduzierung)\". "]
[]
[{"$f":"IF(OR(F3=5,F3=2),A35,\"\")","v":""}]

{"sheet":"Gruppe 2","index":2,"n_rows":37,"n_cols":15,"rows_kept":37,"cut":false,"hidden":false,"merged":[[12,0,15,0],[16,0,19,0],[20,1,20,5],[36,0,44,8],[6,0,7,0],[6,1,7,1],[6,2,6,6],[6,7,7,7],[6,8,7,8],[8,0,11,0]]}
["PERSONALBEDARFSBERECHNUNG",null,null,null,null,null,null,null,"Ó Landkreis Fulda"]
[]
["Gruppentyp:",{"$f":"IF(A28=1,\"<<<Auswahl treffen!\",VLOOKUP(A28,A29:C33,2,FALSE))","v":"<<<Auswahl treffen!"},null,{"$f":"IF(A28=1,\"<<<Auswahl treffen!\",VLOOKUP(A28,A29:C33,1,FALSE))","v":"<<<Auswahl treffen!"},null,{"$f":"IF(D3=\"<<<Auswahl treffen!\",0,D3)","v":0},{"$f":"IF(F3=4,IF(G21>12,1,0),IF(G21>25,1,0))","v":1}]
[null,{"$f":"IF(OR(F3=2,F3=5),IF(SUM(C9:D16)>SUM(C13:D16),\"ACHTUNG GRUPPENTYP FALSCH!!!\",\"\"),\"\")","v":""},null,null,null,null,{"$f":"IF(G21=\"\",\"\",G3)","v":""}]
["Mindestpersonalbedarf nach § 25c Abs. 1 und 2 HKJGB in Verbindung mit Ziff. 4.6. der RV Integrationsplatz"]
[]
["Altersgruppe","Betreuungsmittelwert","Vertraglich aufgenommene Kinder",null,null,null,null,"Fachkraftfaktor","Mindestfachkraftstd. pro Woche"]
[null,null,"Kinder ohne Behinderung","Kinder mit Behinderung","Faktor nach 4.5. RV I-Platz","KmB mit Faktor","Zwischensumme"]
["0 - 3 Jahre",22.5,null,null,2,{"$f":"IF(D9>0,D9*E9,\"\")","v":""},{"$f":"IF(SUM(C9:D9)>0,C9+(D9*E9),\"\")","v":""},0.2,{"$f":"IF(G9=\"\",\"\",B9*G9*H9)","v":""}]
[null,30,null,null,2,"","",0.2,""]
[null,42.5,null,null,2,"","",0.2,""]
[null,50,null,null,2,"","",0.2,""]
["3 Jahre bis Schuleintritt",22.5,null,null,{"$f":"IF($F$3=2,IF(K13+L13+O13=0,N13,K13+L13+O13),3)","v":3},{"$f":"IF(D13>0,IF(E13=N13,7,D13*E13),\"\")","v":""},{"$f":"IF(D13=\"\",IF(C13=\"\",\"\",C13),C13+F13)","v":""},7.0000000000000007E-2,"",null,{"$f":"IF(SUM($D$13:$D$16)>2,3,0)","v":0},{"$f":"IF(SUM($D$13:$D$16)=1,6,0)","v":0},{"$f":"IF(SUM($D$13:$D$16)=2,D13,0)","v":0},{"$f":"IF(M13=2,\"3/4\",0)","v":0},{"$f":"IF(M13=1,3,0)","v":0}]
[null,30,null,null,{"$f":"IF($F$3=2,IF(K14+L14+O14=0,N14,K14+L14+O14),3)","v":3},{"$f":"IF(D14>0,IF(E14=N14,7,D14*E14),\"\")","v":""},{"$f":"IF(D14=\"\",IF(C14=\"\",\"\",C14),C14+F14)","v":""},7.0000000000000007E-2,"",null,{"$f":"IF(SUM($D$13:$D$16)>2,3,0)","v":0},{"$f":"IF(SUM($D$13:$D$16)=1,6,0)","v":0},{"$f":"IF(SUM($D$13:$D$16)=2,D14,0)","v":0},{"$f":"IF(M14=2,\"3/4\",0)","v":0},{"$f":"IF(M14=1,IF(SUM(M14:M16)=1,4,3),0)","v":0}]
[null,42.5,null,null,3,"",{"$f":"IF(D15=\"\",IF(C15=\"\",\"\",C15),C15+F15)","v":""},7.0000000000000007E-2,"",null,{"$f":"IF(SUM($D$13:$D$16)>2,3,0)","v":0},0,0,0,{"$f":"IF(M15=1,IF(SUM(M15:M16)=1,4,3),0)","v":0}]
[null,50,null,null,3,"","",7.0000000000000007E-2,"",null,{"$f":"IF(SUM($D$13:$D$16)>2,3,0)","v":0},0,0,0,{"$f":"IF(M16=1,IF(M16=1,4,3),0)","v":0}]
["Schulkinder",22.5,null,null,1,"","",0.06,""]
[null,30,null,null,1,"","",0.06,""]
[null,42.5,null,null,1,null,"",0.06,""]
[null,50,null,null,1,"","",0.06,""]
["Zwischensumme",{"$f":"IF(G4=1,\"ACHTUNG GRUPPENGRÖßE >>>\",\"\")","v":""},null,null,null,null,{"$f":"IF(SUM(C9:D20)>0,SUM(G9:G20),\"\")","v":""},null,{"$f":"SUM(I9:I20)","v":0}]
["Ausfallzeiten",null,null,null,null,null,null,null,{"$f":"I21/100*15","v":0}]
["Gesamt",null,null,null,null,null,null,{"$f":"IF(I23=\"\",\"GRUPPENTYP WÄHLEN!!!\",\"\")","v":"GRUPPENTYP WÄHLEN!!!"},{"$f":"IF(A28=1,\"\", I21+I22)","v":""}]
[]
[]
[]
[null,null,null,null,{"$f":"IF(A28=1,IF(SUM(C9:D20)>0,1,0),0)","v":0},1,1]
[1,"Gruppentyp",null,null,{"$f":"IF(SUM(C9:D20)=0,IF(OR(A28=2,A28=5),2,0),0)","v":0}]
[1,"BITTE WÄHLEN","<<<Auswahl treffen!"]
[2,"ü3-Gruppe",1]
[3,"altergemischte Gruppe",2]
[4,"Krippengruppe",3]
[5,"ü3-Gruppe (ohne Platzreduzierung)",4]
[]
["Die Rahmenvereinbarung fordert in Ziff. 4.6., dass bei einer Gruppe, deren Belegung aufgrund der Aufnahme von Kindern mit Behinderung reduziert werden muss, bezüglich der Personalbedarfsberechnung von einer vollen Gruppe ausgegangen werden muss. Dies bezieht sich auf die \"Sondersituation\", dass in einer Ü3-Gruppe maximal 20 Kinder aufgenommen werden dürfen. Umgekehrt bedeutet dies, dass in allen anderen Fällen auch keine Personalbedarfsberechnung wie bei einer vollen Gruppe erfolgen muss, z.B. bei unterbesetzten Gruppen. Daher müssen Sie nun entscheiden, ob bei Ihnen eine Situation vorliegt, in der die Aufnahme der Kinder mit Behinderung zwingend zu einer Gruppenreduzierung auf 20 führt; dann verwenden Sie bitte die Tabelle \"Ü3\". In allen anderen Fällen verwenden Sie  bitte den Typ \"Ü3 (ohne Platzreduzierung)\". "]
[]
[{"$f":"IF(OR(F3=5,F3=2),A35,\"\")","v":""}]

{"sheet":"Gruppe 3","index":3,"n_rows":37,"n_cols":15,"rows_kept":37,"cut":false,"hidden":false,"merged":[[12,0,15,0],[16,0,19,0],[20,1,20,5],[36,0,44,8],[6,0,7,0],[6,1,7,1],[6,2,6,6],[6,7,7,7],[6,8,7,8],[8,0,11,0]]}
["PERSONALBEDARFSBERECHNUNG",null,null,null,null,null,null,null,"Ó Landkreis Fulda"]
[]
["Gruppentyp:",{"$f":"IF(A28=1,\"<<<Auswahl treffen!\",VLOOKUP(A28,A29:C33,2,FALSE))","v":"<<<Auswahl treffen!"},null,{"$f":"IF(A28=1,\"<<<Auswahl treffen!\",VLOOKUP(A28,A29:C33,1,FALSE))","v":"<<<Auswahl treffen!"},null,{"$f":"IF(D3=\"<<<Auswahl treffen!\",0,D3)","v":0},{"$f":"IF(F3=4,IF(G21>12,1,0),IF(G21>25,1,0))","v":1}]
[null,{"$f":"IF(OR(F3=2,F3=5),IF(SUM(C9:D16)>SUM(C13:D16),\"ACHTUNG GRUPPENTYP FALSCH!!!\",\"\"),\"\")","v":""},null,null,null,null,{"$f":"IF(G21=\"\",\"\",G3)","v":""}]
["Mindestpersonalbedarf nach § 25c Abs. 1 und 2 HKJGB in Verbindung mit Ziff. 4.6. der RV Integrationsplatz"]
[]
["Altersgruppe","Betreuungsmittelwert","Vertraglich aufgenommene Kinder",null,null,null,null,"Fachkraftfaktor","Mindestfachkraftstd. pro Woche"]
[null,null,"Kinder ohne Behinderung","Kinder mit Behinderung","Faktor nach 4.5. RV I-Platz","KmB mit Faktor","Zwischensumme"]
["0 - 3 Jahre",22.5,null,null,2,{"$f":"IF(D9>0,D9*E9,\"\")","v":""},{"$f":"IF(SUM(C9:D9)>0,C9+(D9*E9),\"\")","v":""},0.2,{"$f":"IF(G9=\"\",\"\",B9*G9*H9)","v":""}]
[null,30,null,null,2,"","",0.2,""]
[null,42.5,null,null,2,"","",0.2,""]
[null,50,null,null,2,"","",0.2,""]
["3 Jahre bis Schuleintritt",22.5,null,null,{"$f":"IF($F$3=2,IF(K13+L13+O13=0,N13,K13+L13+O13),3)","v":3},{"$f":"IF(D13>0,IF(E13=N13,7,D13*E13),\"\")","v":""},{"$f":"IF(D13=\"\",IF(C13=\"\",\"\",C13),C13+F13)","v":""},7.0000000000000007E-2,"",null,{"$f":"IF(SUM($D$13:$D$16)>2,3,0)","v":0},{"$f":"IF(SUM($D$13:$D$16)=1,6,0)","v":0},{"$f":"IF(SUM($D$13:$D$16)=2,D13,0)","v":0},{"$f":"IF(M13=2,\"3/4\",0)","v":0},{"$f":"IF(M13=1,3,0)","v":0}]
[null,30,null,null,{"$f":"IF($F$3=2,IF(K14+L14+O14=0,N14,K14+L14+O14),3)","v":3},{"$f":"IF(D14>0,IF(E14=N14,7,D14*E14),\"\")","v":""},{"$f":"IF(D14=\"\",IF(C14=\"\",\"\",C14),C14+F14)","v":""},7.0000000000000007E-2,"",null,{"$f":"IF(SUM($D$13:$D$16)>2,3,0)","v":0},{"$f":"IF(SUM($D$13:$D$16)=1,6,0)","v":0},{"$f":"IF(SUM($D$13:$D$16)=2,D14,0)","v":0},{"$f":"IF(M14=2,\"3/4\",0)","v":0},{"$f":"IF(M14=1,IF(SUM(M14:M16)=1,4,3),0)","v":0}]
[null,42.5,null,null,3,"",{"$f":"IF(D15=\"\",IF(C15=\"\",\"\",C15),C15+F15)","v":""},7.0000000000000007E-2,"",null,{"$f":"IF(SUM($D$13:$D$16)>2,3,0)","v":0},0,0,0,{"$f":"IF(M15=1,IF(SUM(M15:M16)=1,4,3),0)","v":0}]
[null,50,null,null,3,"","",7.0000000000000007E-2,"",null,{"$f":"IF(SUM($D$13:$D$16)>2,3,0)","v":0},0,0,0,{"$f":"IF(M16=1,IF(M16=1,4,3),0)","v":0}]
["Schulkinder",22.5,null,null,1,"","",0.06,""]
[null,30,null,null,1,"","",0.06,""]
[null,42.5,null,null,1,null,"",0.06,""]
[null,50,null,null,1,"","",0.06,""]
["Zwischensumme",{"$f":"IF(G4=1,\"ACHTUNG GRUPPENGRÖßE >>>\",\"\")","v":""},null,null,null,null,{"$f":"IF(SUM(C9:D20)>0,SUM(G9:G20),\"\")","v":""},null,{"$f":"SUM(I9:I20)","v":0}]
["Ausfallzeiten",null,null,null,null,null,null,null,{"$f":"I21/100*15","v":0}]
["Gesamt",null,null,null,null,null,null,{"$f":"IF(I23=\"\",\"GRUPPENTYP WÄHLEN!!!\",\"\")","v":"GRUPPENTYP WÄHLEN!!!"},{"$f":"IF(A28=1,\"\", I21+I22)","v":""}]
[]
[]
[]
[null,null,null,null,{"$f":"IF(A28=1,IF(SUM(C9:D20)>0,1,0),0)","v":0},1,1]
[1,"Gruppentyp",null,null,{"$f":"IF(SUM(C9:D20)=0,IF(OR(A28=2,A28=5),2,0),0)","v":0}]
[1,"BITTE WÄHLEN","<<<Auswahl treffen!"]
[2,"ü3-Gruppe",1]
[3,"altergemischte Gruppe",2]
[4,"Krippengruppe",3]
[5,"ü3-Gruppe (ohne Platzreduzierung)",4]
[]
["Die Rahmenvereinbarung fordert in Ziff. 4.6., dass bei einer Gruppe, deren Belegung aufgrund der Aufnahme von Kindern mit Behinderung reduziert werden muss, bezüglich der Personalbedarfsberechnung von einer vollen Gruppe ausgegangen werden muss. Dies bezieht sich auf die \"Sondersituation\", dass in einer Ü3-Gruppe maximal 20 Kinder aufgenommen werden dürfen. Umgekehrt bedeutet dies, dass in allen anderen Fällen auch keine Personalbedarfsberechnung wie bei einer vollen Gruppe erfolgen muss, z.B. bei unterbesetzten Gruppen. Daher müssen Sie nun entscheiden, ob bei Ihnen eine Situation vorliegt, in der die Aufnahme der Kinder mit Behinderung zwingend zu einer Gruppenreduzierung auf 20 führt; dann verwenden Sie bitte die Tabelle \"Ü3\". In allen anderen Fällen verwenden Sie  bitte den Typ \"Ü3 (ohne Platzreduzierung)\". "]
[]
[{"$f":"IF(OR(F3=5,F3=2,),A35,\"\")","v":""}]

{"sheet":"Gruppe 4","index":4,"n_rows":37,"n_cols":15,"rows_kept":37,"cut":false,"hidden":false,"merged":[[12,0,15,0],[16,0,19,0],[20,1,20,5],[36,0,44,8],[6,0,7,0],[6,1,7,1],[6,2,6,6],[6,7,7,7],[6,8,7,8],[8,0,11,0]]}
["PERSONALBEDARFSBERECHNUNG",null,null,null,null,null,null,null,"Ó Landkreis Fulda"]
[]
["Gruppentyp:",{"$f":"IF(A28=1,\"<<<Auswahl treffen!\",VLOOKUP(A28,A29:C33,2,FALSE))","v":"<<<Auswahl treffen!"},null,{"$f":"IF(A28=1,\"<<<Auswahl treffen!\",VLOOKUP(A28,A29:C33,1,FALSE))","v":"<<<Auswahl treffen!"},null,{"$f":"IF(D3=\"<<<Auswahl treffen!\",0,D3)","v":0},{"$f":"IF(F3=4,IF(G21>12,1,0),IF(G21>25,1,0))","v":1}]
[null,{"$f":"IF(OR(F3=2,F3=5),IF(SUM(C9:D16)>SUM(C13:D16),\"ACHTUNG GRUPPENTYP FALSCH!!!\",\"\"),\"\")","v":""},null,null,null,null,{"$f":"IF(G21=\"\",\"\",G3)","v":""}]
["Mindestpersonalbedarf nach § 25c Abs. 1 und 2 HKJGB in Verbindung mit Ziff. 4.6. der RV Integrationsplatz"]
[]
["Altersgruppe","Betreuungsmittelwert","Vertraglich aufgenommene Kinder",null,null,null,null,"Fachkraftfaktor","Mindestfachkraftstd. pro Woche"]
[null,null,"Kinder ohne Behinderung","Kinder mit Behinderung","Faktor nach 4.5. RV I-Platz","KmB mit Faktor","Zwischensumme"]
["0 - 3 Jahre",22.5,null,null,2,{"$f":"IF(D9>0,D9*E9,\"\")","v":""},{"$f":"IF(SUM(C9:D9)>0,C9+(D9*E9),\"\")","v":""},0.2,{"$f":"IF(G9=\"\",\"\",B9*G9*H9)","v":""}]
[null,30,null,null,2,"","",0.2,""]
[null,42.5,null,null,2,"","",0.2,""]
[null,50,null,null,2,"","",0.2,""]
["3 Jahre bis Schuleintritt",22.5,null,null,{"$f":"IF($F$3=2,IF(K13+L13+O13=0,N13,K13+L13+O13),3)","v":3},{"$f":"IF(D13>0,IF(E13=N13,7,D13*E13),\"\")","v":""},{"$f":"IF(D13=\"\",IF(C13=\"\",\"\",C13),C13+F13)","v":""},7.0000000000000007E-2,"",null,{"$f":"IF(SUM($D$13:$D$16)>2,3,0)","v":0},{"$f":"IF(SUM($D$13:$D$16)=1,6,0)","v":0},{"$f":"IF(SUM($D$13:$D$16)=2,D13,0)","v":0},{"$f":"IF(M13=2,\"3/4\",0)","v":0},{"$f":"IF(M13=1,3,0)","v":0}]
[null,30,null,null,{"$f":"IF($F$3=2,IF(K14+L14+O14=0,N14,K14+L14+O14),3)","v":3},{"$f":"IF(D14>0,IF(E14=N14,7,D14*E14),\"\")","v":""},{"$f":"IF(D14=\"\",IF(C14=\"\",\"\",C14),C14+F14)","v":""},7.0000000000000007E-2,"",null,{"$f":"IF(SUM($D$13:$D$16)>2,3,0)","v":0},{"$f":"IF(SUM($D$13:$D$16)=1,6,0)","v":0},{"$f":"IF(SUM($D$13:$D$16)=2,D14,0)","v":0},{"$f":"IF(M14=2,\"3/4\",0)","v":0},{"$f":"IF(M14=1,IF(SUM(M14:M16)=1,4,3),0)","v":0}]
[null,42.5,null,null,3,"",{"$f":"IF(D15=\"\",IF(C15=\"\",\"\",C15),C15+F15)","v":""},7.0000000000000007E-2,"",null,{"$f":"IF(SUM($D$13:$D$16)>2,3,0)","v":0},0,0,0,{"$f":"IF(M15=1,IF(SUM(M15:M16)=1,4,3),0)","v":0}]
[null,50,null,null,3,"","",7.0000000000000007E-2,"",null,{"$f":"IF(SUM($D$13:$D$16)>2,3,0)","v":0},0,0,0,{"$f":"IF(M16=1,IF(M16=1,4,3),0)","v":0}]
["Schulkinder",22.5,null,null,1,"","",0.06,""]
[null,30,null,null,1,"","",0.06,""]
[null,42.5,null,null,1,null,"",0.06,""]
[null,50,null,null,1,"","",0.06,""]
["Zwischensumme",{"$f":"IF(G4=1,\"ACHTUNG GRUPPENGRÖßE >>>\",\"\")","v":""},null,null,null,null,{"$f":"IF(SUM(C9:D20)>0,SUM(G9:G20),\"\")","v":""},null,{"$f":"SUM(I9:I20)","v":0}]
["Ausfallzeiten",null,null,null,null,null,null,null,{"$f":"I21/100*15","v":0}]
["Gesamt",null,null,null,null,null,null,{"$f":"IF(I23=\"\",\"GRUPPENTYP WÄHLEN!!!\",\"\")","v":"GRUPPENTYP WÄHLEN!!!"},{"$f":"IF(A28=1,\"\", I21+I22)","v":""}]
[]
[]
[]
[null,null,null,null,{"$f":"IF(A28=1,IF(SUM(C9:D20)>0,1,0),0)","v":0},1,1]
[1,"Gruppentyp",null,null,{"$f":"IF(SUM(C9:D20)=0,IF(OR(A28=2,A28=5),2,0),0)","v":0}]
[1,"BITTE WÄHLEN","<<<Auswahl treffen!"]
[2,"ü3-Gruppe",1]
[3,"altergemischte Gruppe",2]
[4,"Krippengruppe",3]
[5,"ü3-Gruppe (ohne Platzreduzierung)",4]
[]
["Die Rahmenvereinbarung fordert in Ziff. 4.6., dass bei einer Gruppe, deren Belegung aufgrund der Aufnahme von Kindern mit Behinderung reduziert werden muss, bezüglich der Personalbedarfsberechnung von einer vollen Gruppe ausgegangen werden muss. Dies bezieht sich auf die \"Sondersituation\", dass in einer Ü3-Gruppe maximal 20 Kinder aufgenommen werden dürfen. Umgekehrt bedeutet dies, dass in allen anderen Fällen auch keine Personalbedarfsberechnung wie bei einer vollen Gruppe erfolgen muss, z.B. bei unterbesetzten Gruppen. Daher müssen Sie nun entscheiden, ob bei Ihnen eine Situation vorliegt, in der die Aufnahme der Kinder mit Behinderung zwingend zu einer Gruppenreduzierung auf 20 führt; dann verwenden Sie bitte die Tabelle \"Ü3\". In allen anderen Fällen verwenden Sie  bitte den Typ \"Ü3 (ohne Platzreduzierung)\". "]
[]
[{"$f":"IF(OR(F3=5,F3=2),A35,\"\")","v":""}]

{"sheet":"Gruppe 5","index":5,"n_rows":37,"n_cols":15,"rows_kept":37,"cut":false,"hidden":false,"merged":[[12,0,15,0],[16,0,19,0],[20,1,20,5],[36,0,44,8],[6,0,7,0],[6,1,7,1],[6,2,6,6],[6,7,7,7],[6,8,7,8],[8,0,11,0]]}
["PERSONALBEDARFSBERECHNUNG",null,null,null,null,null,null,null,"Ó Landkreis Fulda"]
[]
["Gruppentyp:",{"$f":"IF(A28=1,\"<<<Auswahl treffen!\",VLOOKUP(A28,A29:C33,2,FALSE))","v":"<<<Auswahl treffen!"},null,{"$f":"IF(A28=1,\"<<<Auswahl treffen!\",VLOOKUP(A28,A29:C33,1,FALSE))","v":"<<<Auswahl treffen!"},null,{"$f":"IF(D3=\"<<<Auswahl treffen!\",0,D3)","v":0},{"$f":"IF(F3=4,IF(G21>12,1,0),IF(G21>25,1,0))","v":1}]
[null,{"$f":"IF(OR(F3=2,F3=5),IF(SUM(C9:D16)>SUM(C13:D16),\"ACHTUNG GRUPPENTYP FALSCH!!!\",\"\"),\"\")","v":""},null,null,null,null,{"$f":"IF(G21=\"\",\"\",G3)","v":""}]
["Mindestpersonalbedarf nach § 25c Abs. 1 und 2 HKJGB in Verbindung mit Ziff. 4.6. der RV Integrationsplatz"]
[]
["Altersgruppe","Betreuungsmittelwert","Vertraglich aufgenommene Kinder",null,null,null,null,"Fachkraftfaktor","Mindestfachkraftstd. pro Woche"]
[null,null,"Kinder ohne Behinderung","Kinder mit Behinderung","Faktor nach 4.5. RV I-Platz","KmB mit Faktor","Zwischensumme"]
["0 - 3 Jahre",22.5,null,null,2,{"$f":"IF(D9>0,D9*E9,\"\")","v":""},{"$f":"IF(SUM(C9:D9)>0,C9+(D9*E9),\"\")","v":""},0.2,{"$f":"IF(G9=\"\",\"\",B9*G9*H9)","v":""}]
[null,30,null,null,2,"","",0.2,""]
[null,42.5,null,null,2,"","",0.2,""]
[null,50,null,null,2,"","",0.2,""]
["3 Jahre bis Schuleintritt",22.5,null,null,{"$f":"IF($F$3=2,IF(K13+L13+O13=0,N13,K13+L13+O13),3)","v":3},{"$f":"IF(D13>0,IF(E13=N13,7,D13*E13),\"\")","v":""},{"$f":"IF(D13=\"\",IF(C13=\"\",\"\",C13),C13+F13)","v":""},7.0000000000000007E-2,"",null,{"$f":"IF(SUM($D$13:$D$16)>2,3,0)","v":0},{"$f":"IF(SUM($D$13:$D$16)=1,6,0)","v":0},{"$f":"IF(SUM($D$13:$D$16)=2,D13,0)","v":0},{"$f":"IF(M13=2,\"3/4\",0)","v":0},{"$f":"IF(M13=1,3,0)","v":0}]
[null,30,null,null,{"$f":"IF($F$3=2,IF(K14+L14+O14=0,N14,K14+L14+O14),3)","v":3},{"$f":"IF(D14>0,IF(E14=N14,7,D14*E14),\"\")","v":""},{"$f":"IF(D14=\"\",IF(C14=\"\",\"\",C14),C14+F14)","v":""},7.0000000000000007E-2,"",null,{"$f":"IF(SUM($D$13:$D$16)>2,3,0)","v":0},{"$f":"IF(SUM($D$13:$D$16)=1,6,0)","v":0},{"$f":"IF(SUM($D$13:$D$16)=2,D14,0)","v":0},{"$f":"IF(M14=2,\"3/4\",0)","v":0},{"$f":"IF(M14=1,IF(SUM(M14:M16)=1,4,3),0)","v":0}]
[null,42.5,null,null,3,"",{"$f":"IF(D15=\"\",IF(C15=\"\",\"\",C15),C15+F15)","v":""},7.0000000000000007E-2,"",null,{"$f":"IF(SUM($D$13:$D$16)>2,3,0)","v":0},0,0,0,{"$f":"IF(M15=1,IF(SUM(M15:M16)=1,4,3),0)","v":0}]
[null,50,null,null,3,"","",7.0000000000000007E-2,"",null,{"$f":"IF(SUM($D$13:$D$16)>2,3,0)","v":0},0,0,0,{"$f":"IF(M16=1,IF(M16=1,4,3),0)","v":0}]
["Schulkinder",22.5,null,null,1,"","",0.06,""]
[null,30,null,null,1,"","",0.06,""]
[null,42.5,null,null,1,null,"",0.06,""]
[null,50,null,null,1,"","",0.06,""]
["Zwischensumme",{"$f":"IF(G4=1,\"ACHTUNG GRUPPENGRÖßE >>>\",\"\")","v":""},null,null,null,null,{"$f":"IF(SUM(C9:D20)>0,SUM(G9:G20),\"\")","v":""},null,{"$f":"SUM(I9:I20)","v":0}]
["Ausfallzeiten",null,null,null,null,null,null,null,{"$f":"I21/100*15","v":0}]
["Gesamt",null,null,null,null,null,null,{"$f":"IF(I23=\"\",\"GRUPPENTYP WÄHLEN!!!\",\"\")","v":"GRUPPENTYP WÄHLEN!!!"},{"$f":"IF(A28=1,\"\", I21+I22)","v":""}]
[]
[]
[]
[null,null,null,null,{"$f":"IF(A28=1,IF(SUM(C9:D20)>0,1,0),0)","v":0},1,1]
[1,"Gruppentyp",null,null,{"$f":"IF(SUM(C9:D20)=0,IF(OR(A28=2,A28=5),2,0),0)","v":0}]
[1,"BITTE WÄHLEN","<<<Auswahl treffen!"]
[2,"ü3-Gruppe",1]
[3,"altergemischte Gruppe",2]
[4,"Krippengruppe",3]
[5,"ü3-Gruppe (ohne Platzreduzierung)",4]
[]
["Die Rahmenvereinbarung fordert in Ziff. 4.6., dass bei einer Gruppe, deren Belegung aufgrund der Aufnahme von Kindern mit Behinderung reduziert werden muss, bezüglich der Personalbedarfsberechnung von einer vollen Gruppe ausgegangen werden muss. Dies bezieht sich auf die \"Sondersituation\", dass in einer Ü3-Gruppe maximal 20 Kinder aufgenommen werden dürfen. Umgekehrt bedeutet dies, dass in allen anderen Fällen auch keine Personalbedarfsberechnung wie bei einer vollen Gruppe erfolgen muss, z.B. bei unterbesetzten Gruppen. Daher müssen Sie nun entscheiden, ob bei Ihnen eine Situation vorliegt, in der die Aufnahme der Kinder mit Behinderung zwingend zu einer Gruppenreduzierung auf 20 führt; dann verwenden Sie bitte die Tabelle \"Ü3\". In allen anderen Fällen verwenden Sie  bitte den Typ \"Ü3 (ohne Platzreduzierung)\". "]
[]
[{"$f":"IF(OR(F3=5,F3=2),A35,\"\")","v":""}]

{"sheet":"Dropdownfelder","index":6,"n_rows":5,"n_cols":3,"rows_kept":5,"cut":false,"hidden":true,"merged":[]}
[1,"Gruppentyp"]
[1,"BITTE WÄHLEN","<<<Auswahl treffen!"]
[2,"ü3-Gruppe",1]
[3,"altergemischte Gruppe",2]
[4,"Krippengruppe",3]